{"text_format":"1","workbook":"xlsx","n_sheets":13,"sheets":["Лист с формой","Таблица 1","Таблица 2","Таблица 3","Таблица 4","Определение  Iрпв по табл.1 ","Определение  Iрпв по табл.1(2)","Определение  Iкрд по табл.1","Определение  Iкрд по табл.1(2)","Таблица со статистикой","Таблица со статистикой по РФ","Iрпв для производств.объектов","Iкрд для производств.объектов"],"not_rendered":{"charts":0,"images":0,"macros":1,"external_links":0,"defined_names":6,"comments":0,"pivot_tables":0},"unopened":[],"bounds":{"document_bytes":16777216,"sheet_cells":100000,"rows_first":2000,"rows_last":500,"rows_between":2000,"halvings":0,"cell_chars":16384,"cell_head_chars":4096},"cells_cut":0,"cells_raw":0,"read":"whole","date_system":"1900"}

{"sheet":"Лист с формой","index":0,"n_rows":0,"n_cols":0,"rows_kept":0,"cut":false,"hidden":false,"merged":[]}

{"sheet":"Таблица 1","index":1,"n_rows":34,"n_cols":14,"rows_kept":34,"cut":false,"hidden":true,"merged":[[17,0,18,0],[32,0,33,0],[19,0,20,0],[21,0,22,0],[23,0,25,0],[26,0,27,0],[28,0,29,0],[30,0,31,0],[15,0,16,0],[1,0,3,0],[7,0,8,0],[9,0,14,0],[4,0,6,0]]}
["Индикаторы риска причинения вреда (ущерба) ","Показатель (критерий оценки)","Объекты образования и объекты, на которых осуществляется деятельность детских лагерей","Объекты здравоохранения","Объекты социальной защиты","Объекты религиозного назначения","Объекты культурно-досугового назначения","Объекты временного размещения людей, туризма и отдыха","Объекты торговли","Объекты общественного питания","Объекты бытового обслуживания и предоставления услуг населению","Объекты транспортной инфраструктуры","Объекты административного назначения","Объекты жилого назначения (многоквартирные жилые дома)"]
["1. Степень огнестойкости","I, II",0,0,0,0,0,0,0,0,0,0,0,0]
[null,"III",1,3,1,1,1,1,1,1,1,1,1,1]
[null,"IV,V",3,5,3,3,3,3,3,3,3,3,3,3]
["2. Высота здания, сооружения","до 28 м",0,0,0,0,0,0,0,0,0,0,0,0]
[null,"от 28 м до 50 м (до 75 м для жилых зданий)",2,2,2,2,2,2,2,2,2,2,2,2]
[null,"свыше 50 м (свыше 75 м для жилых зданий)",4,4,4,4,4,4,4,4,4,4,4,4]
["3. Наличие открытых лестниц и (или) многосветных пространств","Да",4,4,4,4,4,4,4,4,4,4,4,4]
[null,"Нет",0,0,0,0,0,0,0,0,0,0,0,0]
["4. Количество людей","До 50",0,0,0,0,0,0,0,0,0,0,0,0]
{"$rows_left_out":25}
{"sheet":"Таблица 2","index":2,"n_rows":43,"n_cols":6,"rows_kept":43,"cut":false,"hidden":true,"merged":[[34,0,35,0],[36,0,37,0],[38,0,42,0],[27,5,29,5],[30,0,31,0],[22,0,29,0],[27,1,29,1],[27,2,29,2],[27,3,29,3],[27,4,29,4],[13,0,14,0],[15,0,16,0],[17,0,18,0],[19,0,21,0],[32,0,33,0],[1,0,3,0],[4,0,5,0],[6,0,8,0],[9,0,10,0],[11,0,12,0]]}
["Индикаторы риска причинения вреда (ущерба) ","Показатель (критерий оценки)","Объекты производственного назначения","Объекты складского назначения","Объекты сельскохозяйственного назначения","Наружные установки"]
["1. Степень огнестойкости","I, II",0,0,0,"-"]
[null,"III",1,1,1,"-"]
[null,"IV,V",4,3,3,"-"]
["2. Наличие людей в селитебной зоне","Да",4,4,"-",5]
[null,"Нет",0,0,"-",0]
["3. Высота здания, сооружения (наружной установки)","до 28м ",0,0,0,0]
[null,"от 28 м до 50 м",2,2,2,2]
[null,"свыше 50 м ",4,4,4,4]
["4. Наличие открытых лестниц и (или) многосветных пространств","Да",4,4,4,"-"]
{"$rows_left_out":34}
{"sheet":"Таблица 3","index":3,"n_rows":32,"n_cols":14,"rows_kept":32,"cut":false,"hidden":true,"merged":[[28,0,29,0],[30,0,31,0],[13,0,14,0],[15,0,16,0],[1,0,2,0],[3,0,4,0],[5,0,6,0],[7,0,8,0],[9,0,10,0],[11,0,12,0],[22,0,23,0],[24,0,25,0],[26,0,27,0],[17,0,18,0],[19,0,21,0]]}
["Критерии добросовестности","Показатель (критерий оценки)","Объекты образования и объекты, на которых осуществляется деятельность детских лагерей","Объекты здравоохранения","Объекты социальной защиты","Объекты религиозного назначения","Объекты культурно-досугового назначения","Объекты временного размещения людей, туризма и отдыха","Объекты торговли","Объекты общественного питания","Объекты бытового обслуживания и предоставления услуг населению","Объекты транспортной инфраструктуры","Объекты административного назначения","Объекты жилого назначения (многоквартирные жилые дома)"]
["1. Наличие в отношении объекта действующего предписания органа государственного пожарного надзора, содержащего сведения об неустраненных нарушениях установленных требований, предъявляемых к путям эвакуации, зонам безопасности для маломобильных групп населения, автоматическим системам противопожарной защиты (автоматические установки пожаротушения и пожарной сигнализации, система оповещения людей о пожаре и управления эвакуацией людей, система противодымной ветиляции)","Да",8,8,8,8,8,8,8,8,8,8,8,8]
[null,"Нет",0,0,0,0,0,0,0,0,0,0,0,0]
["2. Наличие в отношении объекта действующего предписания органа государственного пожарного надзора, содержащего сведения об неустраненных нарушениях установленных требований, предъявляемых к  обеспечению деятельности пожарных подразделений","Да",6,6,6,6,6,6,6,6,6,6,6,6]
[null,"Нет",0,0,0,0,0,0,0,0,0,0,0,0]
["3. Наличие в отношении объекта действующего предписания органа государственного пожарного надзора, содержащего сведения об неустраненных нарушениях установленных требований,   не вошедшими в пункты 1, 2","Да",2,2,2,2,2,2,2,2,2,2,2,2]
[null,"Нет",0,0,0,0,0,0,0,0,0,0,0,0]
["4. Наличие в отношении объекта положительного заключения независимой оценки пожарного риска (аудита пожарной безопасности)","Да",-10,-10,-10,-10,-10,-10,-10,-10,-10,-10,-10,0]
[null,"Нет",0,0,0,0,0,0,0,0,0,0,0,0]
["5. Наличие на объекте учреждений, осуществляющих экономическую деятельность, не соответствующую функциональному назначению здания","Да",3,3,3,3,3,3,3,3,3,3,3,3]
{"$rows_left_out":23}
{"sheet":"Таблица 4","index":4,"n_rows":31,"n_cols":6,"rows_kept":31,"cut":false,"hidden":true,"merged":[[25,0,26,0],[27,0,28,0],[29,0,30,0],[13,0,14,0],[19,0,20,0],[21,0,22,0],[23,0,24,0],[15,0,16,0],[17,0,18,0],[11,0,12,0],[7,0,8,0],[9,0,10,0],[1,0,2,0],[3,0,4,0],[5,0,6,0]]}
["Критерии добросовестности","Показатель (критерий оценки)","Объекты производственного назначения","Объекты складского назначения","Объекты сельскохозяйственного назначения","Наружные установки"]
["1. Наличие в отношении объекта (наружной установки) действующего предписания органа государственного пожарного надзора, содержащего сведения об неустраненных нарушениях установленных требований, предъявляемых к путям эвакуации, зонам безопасности для маломобильных групп населения, автоматическим системам противопожарной защиты (автоматические установки пожаротушения и пожарной сигнализации, система оповещения людей о пожаре и управления эвакуацией людей, система противодымной ветиляции)","Да",8,8,8,9]
[null,"Нет",0,0,0,0]
["2.  Наличие в отношении объекта (наружной установки) действующего предписания органа государственного пожарного надзора, содержащего сведения об неустраненных нарушениях установленных требований, предъявляемых к  обеспечению деятельности пожарных подразделений","Да",6,6,6,8]
[null,"Нет",0,0,0,0]
["3. Наличие в отношении объекта (наружной установки) действующего предписания органа государственного пожарного надзора, содержащего сведения об неустраненных нарушениях установленных требований,   не вошедшх в пункты 1, 2 настоящей таблицы","Да",2,2,2,2]
[null,"Нет",0,0,0,0]
["4. Наличие в отношении объекта (наружной установки) положительного заключения независимой оценки пожарного риска (аудита пожарной безопасности)","Да",-10,-10,-10,-10]
[null,"Нет",0,0,0,0]
["5.Наличие на объекте (на территории) учреждений, осуществляющих экономическую деятельность, не соответствующую функциональному назначению","Да",3,3,3,5]
{"$rows_left_out":22}
{"sheet":"Определение  Iрпв по табл.1 ","index":5,"n_rows":22,"n_cols":3,"rows_kept":22,"cut":false,"hidden":true,"merged":[[0,0,0,2],[2,0,2,2],[4,0,4,2],[6,0,6,2],[5,0,5,2]]}
["Объекты культурно-досугового назначения"]
[]
["Муниципальное бюджетное учреждение культуры \"Социально-культурный центр Спасско-Лутовиновского сельского поселения\""]
[]
["Расположен по адресу: Мценский район, д. Большая Каменка, ул. Молодёжная,1"]
[]
["Определение индикаторов риска Iрпв "]
["Индикаторы риска причинения вреда (ущерба) ","Показатель (критерий оценки)","Значение показателя Iрпв"]
["1. Степень огнестойкости","I, II",{"$f":"INDEX('Таблица 1'!A2:N4,MATCH(B9,'Таблица 1'!B2:B4,0),MATCH(A1,'Таблица 1'!A1:N1,0))","v":0}]
["2. Высота здания, сооружения","до 28 м",{"$f":"INDEX('Таблица 1'!A5:N7,MATCH(B10,'Таблица 1'!B5:B7,0),MATCH(A1,'Таблица 1'!A1:N1,0))","v":0}]
{"$rows_left_out":13}
{"sheet":"Определение  Iрпв по табл.1(2)","index":6,"n_rows":20,"n_cols":3,"rows_kept":20,"cut":false,"hidden":true,"merged":[[0,0,0,2],[2,0,2,2],[4,0,4,2],[5,0,5,2],[6,0,6,2]]}
["Объекты общественного питания"]
[]
["Индивидуальный предприниматель Забелова Татьяна Ильинична"]
[]
["Расположен по адресу: г. Мценск, ул. Гагарина, д. 72 а"]
[]
["Определение индикаторов риска Iрпв "]
["Индикаторы риска причинения вреда (ущерба) ","Показатель (критерий оценки)","Значение показателя Iрпв"]
["1. Степень огнестойкости","I, II",{"$f":"INDEX('Таблица 1'!A2:N4,MATCH(B9,'Таблица 1'!B2:B4,0),MATCH(A1,'Таблица 1'!A1:N1,0))","v":0}]
["2. Высота здания, сооружения","до 28 м",{"$f":"INDEX('Таблица 1'!A5:N7,MATCH(B10,'Таблица 1'!B5:B7,0),MATCH(A1,'Таблица 1'!A1:N1,0))","v":0}]
{"$rows_left_out":11}
{"sheet":"Определение  Iкрд по табл.1","index":7,"n_rows":33,"n_cols":3,"rows_kept":33,"cut":false,"hidden":true,"merged":[[0,0,0,2],[6,0,6,2],[2,0,2,2],[4,0,4,2]]}
["Объекты культурно-досугового назначения"]
[]
["Муниципальное бюджетное учреждение культуры \"Социально-культурный центр Спасско-Лутовиновского сельского поселения\""]
[]
["Расположен по адресу: Мценский район, д. Большая Каменка, ул. Молодёжная,1"]
[]
["Определение критериев добросовестности  Iкрд"]
["Критерии добросовестности","Показатель      (критерий оценки)","Значение показателя Iкрд"]
["1. Наличие в отношении объекта действующего предписания органа государственного пожарного надзора, содержащего сведения об неустраненных нарушениях установленных требований, предъявляемых к путям эвакуации, зонам безопасности для маломобильных групп населения, автоматическим системам противопожарной защиты (автоматические установки пожаротушения и пожарной сигнализации, система оповещения людей о пожаре и управления эвакуацией людей, система противодымной ветиляции)","Нет",{"$f":"INDEX('Таблица 3'!A2:N3,MATCH(B9,'Таблица 3'!B2:B3,0),MATCH(A1,'Таблица 3'!A1:N1,0))","v":0}]
["2. Наличие в отношении объекта действующего предписания органа государственного пожарного надзора, содержащего сведения об неустраненных нарушениях установленных требований, предъявляемых к  обеспечению деятельности пожарных подразделений","Нет",{"$f":"INDEX('Таблица 3'!A4:N5,MATCH(B10,'Таблица 3'!B4:B5,0),MATCH(A1,'Таблица 3'!A1:N1,0))","v":0}]
{"$rows_left_out":24}
{"sheet":"Определение  Iкрд по табл.1(2)","index":8,"n_rows":33,"n_cols":3,"rows_kept":33,"cut":false,"hidden":true,"merged":[[0,0,0,2],[2,0,2,2],[4,0,4,2],[6,0,6,2]]}
["Объекты общественного питания"]
[]
["Индивидуальный предприниматель Забелова Татьяна Ильинична"]
[]
["Расположен по адресу: г. Мценск, ул. Гагарина, д. 72 а"]
[]
["Определение критериев добросовестности  Iкрд"]
["Критерии добросовестности","Показатель      (критерий оценки)","Значение показателя Iкрд"]
["1. Наличие в отношении объекта действующего предписания органа государственного пожарного надзора, содержащего сведения об неустраненных нарушениях установленных требований, предъявляемых к путям эвакуации, зонам безопасности для маломобильных групп населения, автоматическим системам противопожарной защиты (автоматические установки пожаротушения и пожарной сигнализации, система оповещения людей о пожаре и управления эвакуацией людей, система противодымной ветиляции)","Нет",{"$f":"INDEX('Таблица 3'!A2:N3,MATCH(B9,'Таблица 3'!B2:B3,0),MATCH(A1,'Таблица 3'!A1:N1,0))","v":0}]
["2. Наличие в отношении объекта действующего предписания органа государственного пожарного надзора, содержащего сведения об неустраненных нарушениях установленных требований, предъявляемых к  обеспечению деятельности пожарных подразделений","Нет",{"$f":"INDEX('Таблица 3'!A4:N5,MATCH(B10,'Таблица 3'!B4:B5,0),MATCH(A1,'Таблица 3'!A1:N1,0))","v":0}]
{"$rows_left_out":24}
{"sheet":"Таблица со статистикой","index":9,"n_rows":18,"n_cols":10,"rows_kept":18,"cut":false,"hidden":true,"merged":[[0,9,1,9],[0,7,1,7],[0,8,1,8],[0,0,1,0],[0,1,1,1],[0,2,1,2],[0,3,0,5],[0,6,1,6]]}
["№ п/п","Тип объекта","Сведен.  о кол-ве объектов, ед.","Сведения о пожарах и их последствиях",null,null,"Вероятность возникновения пожара, [год-1]","Ожид. риск негатив. последствий пожаров, [год-1 чел./ед.] × 10³","Показатель тяжести последствий (Kгт)","Категория риска"]
[null,null,null,"Кол-во пожаров, ед","Погибло людей, чел.","Травми-ровано людей, чел."]
[1,"Объекты образования и объекты, на которых осуществляется деятельность детских лагерей",157350,408,4,16,{"$f":"D3/C3","v":2.5929456625357482E-3},{"$f":"(E3+F3)/C3*1000","v":0.12710517953606609},{"$f":"H3/1000/'Таблица со статистикой по РФ'!F3","v":4.07928742085672},{"$f":"IF(I3>=100,\"Чрезвычайно высокий\",IF(I3>=45,\"Высокий\",IF(I3>=20,\"Значительный\",IF(I3>=9,\"Средний\",IF(I3>=4,\"Умеренный\",\"Низкий\")))))","v":"Умеренный"}]
[2,"Объекты здравоохранения",56626,232,3,19,4.097057888602409E-3,0.3885141101260905,{"$f":"H4/1000/'Таблица со статистикой по РФ'!F3","v":12.468891732401818},"Средний"]
[3,"Объекты социальной защиты",6788,34,3,6,5.0088391278727169E-3,1.3258691809074838,{"$f":"H5/1000/'Таблица со статистикой по РФ'!F3","v":42.55217207606249},"Значительный"]
[4,"Объекты религиозного назначения",18653,64,1,11,3.431083471827588E-3,0.64332815096767282,{"$f":"H6/1000/'Таблица со статистикой по РФ'!F3","v":20.646841012334903},"Значительный"]
[5,"Объекты культурно-досугового назначения",67643,220,0,2,3.2523690551867893E-3,2.9566991410788997E-2,{"$f":"H7/1000/'Таблица со статистикой по РФ'!F3","v":0.94891692513904602},"Низкий"]
[6,"Объекты временного размещения людей, туризма и отдыха",35660,273,15,41,7.655636567582726E-3,1.5703869882220978,{"$f":"H8/1000/'Таблица со статистикой по РФ'!F3","v":50.399676160433366},"Высокий"]
[7,"Объекты торговли",490944,2432,3,27,4.9537218094120716E-3,6.110676574110286E-2,{"$f":"H9/1000/'Таблица со статистикой по РФ'!F3","v":1.9611479384771122},"Низкий"]
[8,"Объекты общественного питания",71637,652,5,33,9.1014419922665658E-3,0.53045214065357282,{"$f":"H10/1000/'Таблица со статистикой по РФ'!F3","v":17.024221614199774},"Средний"]
{"$rows_left_out":9}
{"sheet":"Таблица со статистикой по РФ","index":10,"n_rows":3,"n_cols":6,"rows_kept":3,"cut":false,"hidden":true,"merged":[]}
[]
["Индивидуальный пожарный риск воздействия критических значений опасных факторов пожара на человека в зданиях и сооружениях -  Dдоп"," Численность постоянного населения в РФ  в период проведения ежегодного мониторинга, чел. -  Nнас","Общее количество объектов защиты в РФ в период проведения ежегодного мониторинга - Nоб","Общее количество погибших людей при пожарах на объектах защиты в РФ в период проведения ежегодного мониторинга  - Nг\n","Общее количество травмированных людей при пожарах на объектах защиты в РФ в период проведения ежегодного мониторинга - Nт","Допустимый риск негативных последствий пожаров - Qсдоп"]
[9.9999999999999995E-7,146745098,9954560,8507,9474,{"$f":"A3*B3*(D3+E3)/(C3*D3)","v":3.1158672195099173E-5}]

{"sheet":"Iрпв для производств.объектов","index":11,"n_rows":24,"n_cols":3,"rows_kept":24,"cut":false,"hidden":true,"merged":[[6,0,6,2],[0,0,0,2],[2,0,2,2],[5,0,5,2],[4,0,4,2]]}
["Объекты складского назначения"]
[]
["Общество с ограниченной ответственностью «Экостройсервис»"]
[]
["Расположен по адресу: Орловская область, г. Мценск, ул. Болховская, полигон ТБО"]
[]
["Определение индикаторов риска Iрпв "]
["Индикаторы риска причинения вреда (ущерба) ","Показатель (критерий оценки)","Значение показателя Iрпв"]
["1. Степень огнестойкости","I, II",{"$f":"INDEX('Таблица 2'!A2:F4,MATCH(B9,'Таблица 2'!B2:B4,0),MATCH(A1,'Таблица 2'!A1:F1,0))","v":0}]
["2. Наличие людей в селитебной зоне","Нет",{"$f":"INDEX('Таблица 2'!A5:F6,MATCH(B10,'Таблица 2'!B5:B6,0),MATCH(A1,'Таблица 2'!A1:F1,0))","v":0}]
{"$rows_left_out":15}
{"sheet":"Iкрд для производств.объектов","index":12,"n_rows":33,"n_cols":3,"rows_kept":33,"cut":false,"hidden":true,"merged":[[6,0,6,2],[0,0,0,2],[1,0,1,2],[3,0,3,2],[5,0,5,2],[2,0,2,2],[4,0,4,2]]}
["Объекты складского назначения"]
[]
["Общество с ограниченной ответственностью «Экостройсервис»"]
[]
["Расположен по адресу: Орловская область, г. Мценск, ул. Болховская, полигон ТБО"]
[]
["Определение критериев добросовестности  Iкрд"]
["Критерии добросовестности","Показатель      (критерий оценки)","Значение показателя Iкрд"]
["1. Наличие в отношении объекта (наружной установки) действующего предписания органа государственного пожарного надзора, содержащего сведения об неустраненных нарушениях установленных требований, предъявляемых к путям эвакуации, зонам безопасности для маломобильных групп населения, автоматическим системам противопожарной защиты (автоматические установки пожаротушения и пожарной сигнализации, система оповещения людей о пожаре и управления эвакуацией людей, система противодымной ветиляции)","Нет",{"$f":"INDEX('Таблица 4'!A2:F3,MATCH(B9,'Таблица 4'!B2:B3,0),MATCH(A1,'Таблица 4'!A1:F1,0))","v":0}]
["2. Наличие в отношении объекта (наружной установки) действующего предписания органа государственного пожарного надзора, содержащего сведения об неустраненных нарушениях установленных требований, предъявляемых к  обеспечению деятельности пожарных подразделений ","Нет",{"$f":"INDEX('Таблица 4'!A4:F5,MATCH(B10,'Таблица 4'!B4:B5,0),MATCH(A1,'Таблица 4'!A1:F1,0))","v":0}]
{"$rows_left_out":23}